BDBM50529631 CHEMBL3754102
SMILES [H][C@@]12CC(C)(C)CC[C@@]1(CC[C@]1(C)C2=CC[C@]2([H])[C@@]3(C)CC[C@H](O)C(C)(C)[C@]3([H])CC[C@@]12C)C(=O)NO
InChI Key InChIKey=GZSHDELCJRZSTQ-GTOFXWBISA-N
Data  2 EC50
  Tab Delimited (TSV)   2D SDfile   Computed 3D by Vconf -m prep SDfile
Find this compound or compounds like it in BindingDB:
Activity Spreadsheet -- Enzyme Inhibition Constant Data from BindingDB
Found 2 hits for monomerid = 50529631
LigandPNGBDBM50529631(CHEMBL3754102)
Affinity DataEC50:  1.64E+4nM. Assay description: Inhibition of PHD (unknown origin) expressed in mouse NIH/3T3 cells harboring HRE-driven luciferase gene assessed as transactivation of HIF1alpha aft...
Ligand InfoPC cidPC sid
In DepthDetails ArticlePubMed
LigandPNGBDBM50529631(CHEMBL3754102)
Affinity DataEC50:  1.64E+4nM. Assay description: Inhibition of PHD (unknown origin) expressed in mouse NIH/3T3 cells harboring HRE-driven luciferase gene assessed as transactivation of HIF1alpha aft...
Ligand InfoPC cidPC sid
In DepthDetails ArticlePubMed